{"text_format":"1","workbook":"xlsx","n_sheets":13,"sheets":["Rough In","Finish","Labor","R Estimate","R Cost","F Cost","Furnace","Coil","Air Handler","Geothermal","Heater Pack","Misc","Dropdown Lists"],"not_rendered":{"charts":0,"images":10,"macros":1,"external_links":1,"defined_names":17,"comments":0,"pivot_tables":0},"unopened":[],"bounds":{"document_bytes":16777216,"sheet_cells":100000,"rows_first":2000,"rows_last":500,"rows_between":2000,"halvings":0,"cell_chars":16384,"cell_head_chars":4096},"cells_cut":0,"cells_raw":0,"read":"whole","date_system":"1904"}

{"sheet":"Rough In","index":0,"n_rows":167,"n_cols":11,"rows_kept":167,"cut":false,"hidden":false,"merged":[[131,0,131,1],[144,0,144,1],[153,0,153,1],[157,0,157,1],[86,0,86,1],[95,0,95,1],[104,0,104,1],[111,0,111,1],[121,0,121,1],[21,0,21,1],[29,0,29,1],[56,0,56,1],[63,0,63,1],[66,0,66,1],[130,8,130,9],[158,4,158,5],[133,4,133,5],[143,4,143,5],[153,4,153,5],[146,8,146,9],[156,8,156,9],[111,8,111,9],[115,4,115,5],[119,4,119,5],[121,8,121,9],[125,8,125,9],[91,4,91,5],[100,4,100,5],[98,8,98,9],[92,8,92,9],[105,8,105,9],[69,8,69,9],[69,4,69,5],[74,4,74,5],[81,4,81,5],[80,8,80,9],[74,8,74,9],[54,8,54,9],[50,4,50,5],[58,4,58,5],[59,8,59,9],[64,8,64,9],[1,8,1,10],[1,3,1,5],[24,8,24,9],[28,8,28,9],[35,4,35,5],[181,4,181,6],[181,8,181,10],[6,0,6,1],[3,2,4,4],[2,3,2,10],[3,6,3,7],[4,6,4,7],[3,9,3,10],[4,9,4,10],[0,0,4,1],[7,4,7,5],[20,4,20,5],[7,8,7,9],[13,8,13,9],[0,2,0,10],[1,6,1,7]]}
[{"$error":"#VALUE!"},null,"New Construction Rough In - Costing Form"]
[null,null,"PO:",null,null,null,"Deliver On:"]
[null,null,"Notes:"]
[null,null,"Add following equipment previously purchased to delivery:",null,null,"Ticket #","Job PO",null,"Model","Serial #"]
[]
[]
[null,null,"#"]
["Furnace",null,null,null,"Transitional Takeoffs",null,"#",null,"Stick-On Flat 90’s ",null,"#"]
["Coil",null,null,null,"24x12","ST-1203-2412",null,null,"8\"","ST-306-08"]
["Air Handler",null,null,null,"24x10","ST-1203-2410",null,null,"7\"","ST-306-07"]
["Geothermal",null,null,null,"20x10","ST-1203-2010",null,null,"6\"","ST-306-06"]
["Heater Pack",null,null,null,"24x8","ST-1203-2408",null,null,"4\"","ST-306-04"]
["Bottom Box",{"$f":"_xlfn.LET(_xlpm.furn,B8,_xlpm.ah,B10,_xlpm.fw,IFERROR(_xlfn.XLOOKUP(_xlpm.furn,Furnace!$C:$C,Furnace!$H:$H),\"\"),_xlpm.aw,IFERROR(_xlfn.XLOOKUP(_xlpm.ah,'Air Handler'!$C:$C,'Air Handler'!$F:$F),\"\"),IF(_xlpm.furn<>\"\",IFERROR(_xlfn.XLOOKUP(_xlpm.fw,Misc!$B$4:$B$7,Misc!$E$4:$E$7),\"width not matched\"),IF(_xlpm.ah<>\"\",IFERROR(_xlfn.XLOOKUP(_xlpm.aw,Misc!$B$9:$B$12,Misc!$E$9:$E$12),\"width not matched\"),\"\")))","v":""},null,null,"22x8","ST-1203-2208"]
["Plenum",{"$f":"_xlfn.LET(_xlpm.coil,B9,_xlpm.furn,B8,_xlpm.ah,B10,_xlpm.cw,IFERROR(_xlfn.XLOOKUP(_xlpm.coil,Coil!$C:$C,Coil!$F:$F),\"\"),_xlpm.fw,IFERROR(_xlfn.XLOOKUP(_xlpm.furn,Furnace!$C:$C,Furnace!$H:$H),\"\"),_xlpm.aw,IFERROR(_xlfn.XLOOKUP(_xlpm.ah,'Air Handler'!$C:$C,'Air Handler'!$F:$F),\"\"),IF(_xlpm.coil<>\"\",IFERROR(_xlfn.XLOOKUP(_xlpm.cw,Misc!$B$26:$B$29,Misc!$E$26:$E$29),\"width not matched\"),IF(_xlpm.furn<>\"\",IFERROR(_xlfn.XLOOKUP(_xlpm.fw,Misc!$B$16:$B$19,Misc!$E$16:$E$19),\"width not matched\"),IF(_xlpm.ah<>\"\",IFERROR(_xlfn.XLOOKUP(_xlpm.aw,Misc!$B$21:$B$24,Misc!$E$21:$E$24),\"width not matched\"),\"\"))))","v":""},null,null,"20x8","ST-1203-2008",null,null,"Round Pipe (5' Sections) 30GA "]
["Coil Adapter",{"$f":"_xlfn.LET(_xlpm.furn,B8,_xlpm.coil,B9,_xlpm.fw,IFERROR(_xlfn.XLOOKUP(_xlpm.furn,Furnace!$C:$C,Furnace!$H:$H),\"\"),_xlpm.cw,IFERROR(_xlfn.XLOOKUP(_xlpm.coil,Coil!$C:$C,Coil!$F:$F),\"\"),IF(OR(_xlpm.furn=\"\",_xlpm.coil=\"\",_xlpm.fw=\"\",_xlpm.cw=\"\"),\"\",IF(_xlpm.fw=_xlpm.cw,\"\",_xlfn.LET(_xlpm.lo,IF(_xlpm.fw<=_xlpm.cw,_xlpm.fw,_xlpm.cw),_xlpm.hi,IF(_xlpm.fw<=_xlpm.cw,_xlpm.cw,_xlpm.fw),IFERROR(_xlfn.XLOOKUP(1,(Misc!$B$33:$B$45=_xlpm.lo)*(Misc!$C$33:$C$45=_xlpm.hi),Misc!$E$33:$E$45),\"no adapter found\")))))","v":""},null,null,"18x8","ST-1203-1808",null,null,"3\"","ST-RDP-053003"]
{"$rows_left_out":153}
{"sheet":"Finish","index":1,"n_rows":199,"n_cols":11,"rows_kept":199,"cut":false,"hidden":false,"merged":[[184,4,184,6],[184,8,184,9],[77,4,77,6],[107,4,107,6],[107,8,107,9],[142,8,142,9],[143,4,143,6],[161,8,161,9],[68,8,68,9],[73,8,73,9],[28,8,28,10],[30,4,30,6],[34,8,34,10],[7,4,7,5],[7,8,7,9],[37,0,37,2],[37,4,37,6],[66,4,66,6],[21,8,21,10],[0,0,4,1],[0,2,0,10],[1,3,1,5],[1,6,1,7],[1,8,1,10],[2,3,2,10],[3,2,4,4],[3,6,3,7],[3,9,3,10],[4,6,4,7],[4,9,4,10],[15,4,15,6],[15,8,15,10],[25,0,25,2],[25,8,25,10],[23,4,23,6]]}
[{"$error":"#VALUE!"},null,"New Construction Finish - Costing Form"]
[null,null,"PO:",null,null,null,"Deliver On:"]
[null,null,"Notes:"]
[null,null,"Add following equipment previously purchased to delivery:",null,null,"Ticket #","Job PO",null,"Model","Serial #"]
[]
[]
[]
[null,null,"#",null,"Side Wall Registers",null,"#",null,"Exterior Exhaust Caps",null,"#"]
["OUTDOOR UNIT",null,null,null,"4x10","LI-10V10X4",null,null,"4\" Brown Exhaust","DE-HS4B"]
["OUTDOOR UNIT",null,null,null,"4x12","LI-10V12X4",null,null,"4\" White Exhaust","DE-HS4W"]
["OUTDOOR UNIT",null,null,null,"4x14","LI-10V14X4",null,null,"6\" White Exhaust","DE-HS6W"]
["AC Poles:","SPS-2/POLE",null,null,"6x10","LI-10V10X6",null,null,"6\" Brown Exhuast","DE-HS6B"]
["Pole End Cap","SPS-2/CAP",null,null,"6x12","LI-10V12X6",null,null,"8\" Exhaust"]
["Locking Caps:","CD2290",null,null,"6x14","LI-10V14X6",null,null,"10\" Exhaust"]
["6' UV Armor Flex - 3/4\"","P809-T03434"]
{"$rows_left_out":185}
{"sheet":"Labor","index":2,"n_rows":56,"n_cols":3,"rows_kept":56,"cut":false,"hidden":false,"merged":[[6,1,6,2],[50,1,50,2],[4,1,4,2]]}
[]
[null,null,"Sharif Riggen"]
[null,null,{"$f":"TODAY()","v":"2026-07-06"}]
[]
[null,"Residential Labor Estimate   "]
[]
[null,"For:"]
[null,"Systems on Job:",1]
[null,"Rough-In Labor:"]
[null,null,"Labor"]
[null,"Lower Level Left System:"]
[null," - Delivery/Cut-Out/Equip. Set/Config. Duct"]
[null," - Return Ductwork"]
[null," - Supply Ductwork"]
[null," - Venting (fans, dryer vent, hood vent)"]
{"$rows_left_out":42}
{"sheet":"R Estimate","index":3,"n_rows":179,"n_cols":11,"rows_kept":179,"cut":false,"hidden":false,"merged":[[176,4,176,5],[177,4,177,5],[178,4,179,5],[178,6,179,6],[174,0,174,1],[175,0,175,1],[176,0,176,1],[170,4,170,5],[170,0,170,1],[170,8,170,9],[115,4,115,5],[119,4,119,5],[133,4,133,5],[143,4,143,5],[146,8,146,9],[153,4,153,5],[159,0,159,1],[156,8,156,9],[158,4,158,5],[155,0,155,1],[100,4,100,5],[91,4,91,5],[81,4,81,5],[85,8,85,9],[92,8,92,9],[74,4,74,5],[69,8,69,9],[69,4,69,5],[74,8,74,9],[80,8,80,9],[7,4,7,5],[20,4,20,5],[13,8,13,9],[7,8,7,9],[24,8,24,9],[28,8,28,9],[111,8,111,9],[54,8,54,9],[59,8,59,9],[64,8,64,9],[98,8,98,9],[105,8,105,9],[31,0,31,1],[58,0,58,1],[65,0,65,1],[146,0,146,1],[123,0,123,1],[133,0,133,1],[106,0,106,1],[112,0,112,1],[113,0,113,1],[88,0,88,1],[97,0,97,1],[68,0,68,1],[58,4,58,5],[35,4,35,5],[50,4,50,5],[4,9,4,10],[6,0,6,1],[0,0,4,1],[0,2,0,10],[1,3,1,5],[1,6,1,7],[1,8,1,10],[2,3,2,10],[3,2,4,4],[3,6,3,7],[3,9,3,10],[4,6,4,7],[23,0,23,1]]}
[{"$error":"#VALUE!"},null,"New Construction Rough In - Costing Form"]
[null,null,"PO:",null,null,null,"Deliver On:"]
[null,null,"Notes:"]
[null,null,"Add following equipment previously purchased to delivery:",null,null,"Ticket #","Job PO",null,"Model","Serial #"]
[]
[]
[null,null,"#"]
["Furnace",null,{"$f":"IF('Rough In'!B8=\"\",\"\",IFERROR(_xlfn.XLOOKUP('Rough In'!B8,Furnace!$C:$C,Furnace!$I:$I),\"\"))","v":""},null,"Transitional Takeoffs",null,"#",null,"Stick-On Flat 90’s ",null,"#"]
["Coil",null,{"$f":"IF('Rough In'!B9=\"\",\"\",IFERROR(_xlfn.XLOOKUP('Rough In'!B9,Coil!$C:$C,Coil!$H:$H),\"\"))","v":""},null,"24x12","ST-1203-2412",{"$f":"'Rough In'!G9*'R Cost'!F8","v":0},null,"8\"","ST-306-08",{"$f":"IFERROR('Rough In'!K9*_xlfn.XLOOKUP($J9,'R Cost'!$H:$H,'R Cost'!$I:$I),\"\")","v":0}]
["Air Handler",null,{"$f":"IF('Rough In'!B10=\"\",\"\",IFERROR(_xlfn.XLOOKUP('Rough In'!B10,'Air Handler'!$C:$C,'Air Handler'!$J:$J),\"\"))","v":""},null,"24x10","ST-1203-2410",{"$f":"'Rough In'!G10*'R Cost'!F9","v":0},null,"7\"","ST-306-07",{"$f":"IFERROR('Rough In'!K10*_xlfn.XLOOKUP($J10,'R Cost'!$H:$H,'R Cost'!$I:$I),\"\")","v":0}]
["Geothermal",null,{"$f":"IF('Rough In'!B11=\"\",\"\",IFERROR(_xlfn.XLOOKUP('Rough In'!B11,Geothermal!$C:$C,Geothermal!$I:$I),\"\"))","v":""},null,"20x10","ST-1203-2010",{"$f":"'Rough In'!G11*'R Cost'!F10","v":0},null,"6\"","ST-306-06",{"$f":"IFERROR('Rough In'!K11*_xlfn.XLOOKUP($J11,'R Cost'!$H:$H,'R Cost'!$I:$I),\"\")","v":0}]
["Heater Pack","",{"$f":"IF('Rough In'!B12=\"\",\"\",IFERROR(_xlfn.XLOOKUP('Rough In'!B12,'Heater Pack'!$C:$C,'Heater Pack'!$F:$F),\"\"))","v":""},null,"24x8","ST-1203-2408",{"$f":"'Rough In'!G12*'R Cost'!F11","v":0},null,"4\"","ST-306-04",{"$f":"IFERROR('Rough In'!K12*_xlfn.XLOOKUP($J12,'R Cost'!$H:$H,'R Cost'!$I:$I),\"\")","v":0}]
["Bottom Box",{"$f":"_xlfn.LET(_xlpm.furn,B8,_xlpm.ah,B10,_xlpm.fw,IFERROR(_xlfn.XLOOKUP(_xlpm.furn,Furnace!$C:$C,Furnace!$H:$H),\"\"),_xlpm.aw,IFERROR(_xlfn.XLOOKUP(_xlpm.ah,'Air Handler'!$C:$C,'Air Handler'!$F:$F),\"\"),IF(_xlpm.furn<>\"\",IFERROR(_xlfn.XLOOKUP(_xlpm.fw,Misc!$B$4:$B$7,Misc!$E$4:$E$7),\"width not matched\"),IF(_xlpm.ah<>\"\",IFERROR(_xlfn.XLOOKUP(_xlpm.aw,Misc!$B$9:$B$12,Misc!$E$9:$E$12),\"width not matched\"),\"\")))","v":""},{"$f":"IF('Rough In'!B13=\"\",\"\",IFERROR(_xlfn.XLOOKUP('Rough In'!B13,Misc!$E:$E,Misc!$F:$F),\"\"))","v":""},null,"22x8","ST-1203-2208",{"$f":"'Rough In'!G13*'R Cost'!F12","v":0}]
["Plenum",{"$f":"_xlfn.LET(_xlpm.coil,B9,_xlpm.furn,B8,_xlpm.ah,B10,_xlpm.cw,IFERROR(_xlfn.XLOOKUP(_xlpm.coil,Coil!$C:$C,Coil!$F:$F),\"\"),_xlpm.fw,IFERROR(_xlfn.XLOOKUP(_xlpm.furn,Furnace!$C:$C,Furnace!$H:$H),\"\"),_xlpm.aw,IFERROR(_xlfn.XLOOKUP(_xlpm.ah,'Air Handler'!$C:$C,'Air Handler'!$F:$F),\"\"),IF(_xlpm.coil<>\"\",IFERROR(_xlfn.XLOOKUP(_xlpm.cw,Misc!$B$26:$B$29,Misc!$E$26:$E$29),\"width not matched\"),IF(_xlpm.furn<>\"\",IFERROR(_xlfn.XLOOKUP(_xlpm.fw,Misc!$B$16:$B$19,Misc!$E$16:$E$19),\"width not matched\"),IF(_xlpm.ah<>\"\",IFERROR(_xlfn.XLOOKUP(_xlpm.aw,Misc!$B$21:$B$24,Misc!$E$21:$E$24),\"width not matched\"),\"\"))))","v":""},{"$f":"IF('Rough In'!B14=\"\",\"\",IFERROR(_xlfn.XLOOKUP('Rough In'!B14,Misc!$E:$E,Misc!$F:$F),\"\"))","v":""},null,"20x8","ST-1203-2008",{"$f":"'Rough In'!G14*'R Cost'!F13","v":0},null,"Round Pipe (5' Sections) 30GA "]
["Coil Adapter",{"$f":"_xlfn.LET(_xlpm.furn,B8,_xlpm.coil,B9,_xlpm.fw,IFERROR(_xlfn.XLOOKUP(_xlpm.furn,Furnace!$C:$C,Furnace!$H:$H),\"\"),_xlpm.cw,IFERROR(_xlfn.XLOOKUP(_xlpm.coil,Coil!$C:$C,Coil!$F:$F),\"\"),IF(OR(_xlpm.furn=\"\",_xlpm.coil=\"\",_xlpm.fw=\"\",_xlpm.cw=\"\"),\"\",IF(_xlpm.fw=_xlpm.cw,\"\",_xlfn.LET(_xlpm.lo,IF(_xlpm.fw<=_xlpm.cw,_xlpm.fw,_xlpm.cw),_xlpm.hi,IF(_xlpm.fw<=_xlpm.cw,_xlpm.cw,_xlpm.fw),IFERROR(_xlfn.XLOOKUP(1,(Misc!$B$33:$B$45=_xlpm.lo)*(Misc!$C$33:$C$45=_xlpm.hi),Misc!$E$33:$E$45),\"no adapter found\")))))","v":""},{"$f":"IF('Rough In'!B15=\"\",\"\",IFERROR(_xlfn.XLOOKUP('Rough In'!B15,Misc!$E:$E,Misc!$F:$F),\"\"))","v":""},null,"18x8","ST-1203-1808",{"$f":"'Rough In'!G15*'R Cost'!F14","v":0},null,"3\"","ST-RDP-053003",{"$f":"IF('Rough In'!K15=\"\",0,IFERROR(SUBSTITUTE(SUBSTITUTE('Rough In'!K15,\"'\",\"\"),\"\"\"\",\"\")/5*'R Cost'!I14,\"\"))","v":0}]
{"$rows_left_out":165}
{"sheet":"R Cost","index":4,"n_rows":182,"n_cols":9,"rows_kept":182,"cut":false,"hidden":false,"merged":[[154,0,154,2],[150,0,150,2],[141,0,141,2],[96,6,96,8],[6,6,6,8],[12,6,12,8],[23,6,23,8],[27,6,27,8],[79,6,79,8],[90,6,90,8],[177,3,177,5],[177,6,177,8],[35,3,35,5],[19,3,19,5],[128,0,128,2],[118,0,118,2],[108,0,108,2],[84,0,84,2],[84,6,84,8],[93,0,93,2],[64,0,64,2],[61,0,61,2],[27,0,27,2],[19,0,19,2],[173,0,173,2],[164,0,164,2],[2,1,2,8],[0,0,0,8],[54,0,54,2],[1,3,1,4],[1,6,1,8],[3,0,4,0],[6,3,6,5]]}
["Rough Costing Form"]
[null,null,"PO:",null,null,"Deliver On:"]
["Notes:"]
["Add following equipment previously purchased to delivery:","Ticket #","Job PO","Model","Serial #"]
[]
[null,null,"COST",null,null,"COST",null,null,"COST"]
["FURNACE/AIR HANDLER",null,null,"Transitional Takeoffs",null,null,"Stick-On Flat 90’s "]
["COIL",null,null,"24x12","ST-1203-2412",64.63,"8\"","ST-306-08",14.19]
["HEAT PACK",null,null,"24x10","ST-1203-2410",78.09,"7\"","ST-306-07",11.63]
["Bottom Box","SEE SECOND SHEET",null,"20x10","ST-1203-2010",46.05,"6\"","ST-306-06",10.33]
["Plenum","SEE SECOND SHEET",null,"24x8","ST-1203-2408",39.450000000000003,"4\"","ST-306-04",9.8800000000000008]
["Coil Adapter/Spacer","SEE SECOND SHEET",null,"22x8","ST-1203-2208",37.590000000000003]
["Com. Wire(14-4 50FT)","14-4C",75.38,"20x8","ST-1203-2008",37.08,"Round Pipe (5' Sections) 30GA "]
["Com. Wire(14-4 250FT)","14-4C-250",598.38,"18x8","ST-1203-1808",34.21,"3\"","ST-RDP-053003",6.75]
["Bricks","HO-619345",1.48,"16x8","ST-1203-1608",32.71,"4\"","ST-RDP-053004",7.94]
{"$rows_left_out":168}
{"sheet":"F Cost","index":5,"n_rows":201,"n_cols":9,"rows_kept":201,"cut":false,"hidden":false,"merged":[[5,1,5,5],[0,0,0,8],[2,2,3,2],[2,3,3,4],[2,5,3,5],[2,6,3,8],[38,6,38,8],[6,0,7,0],[9,3,9,4],[9,6,9,7],[17,3,17,5],[17,6,17,8],[23,6,23,8],[25,3,25,5],[27,0,27,2],[29,6,29,8],[32,3,32,5],[32,6,32,8],[186,3,186,5],[186,6,186,7],[39,0,39,2],[39,3,39,5],[68,3,68,5],[70,6,70,7],[75,6,75,7],[79,3,79,5],[109,3,109,5],[109,6,109,7],[144,6,144,7],[145,3,145,5],[163,6,163,7]]}
["Finish Material Order"]
[]
[null,null,"PO:",null,null,"Deliver On:"]
[]
[]
["Notes:"]
["Add following equipment previously purchased to delivery:","Ticket #","Job PO","Qty","Model","Serial #"]
[]
[]
[null,null,"COST","Side Wall Registers",null,"COST","Exterior Exhaust Caps",null,"COST"]
["OUTDOOR UNIT",null,null,"4x10","LI-10V10X4",5.73,"4\" Brown Exhaust","DE-HS4B",2.82]
[null,null,null,"4x12","LI-10V12X4",6.19,"4\" White Exhaust","DE-HS4W",2.74]
[null,null,null,"4x14","LI-10V14X4",9.75,"6\" White Exhaust","DE-HS6W",4.72]
["AC Poles:","SPS-2/POLE",11.21,"6x10","LI-10V10X6",6.04,"6\" Brown Exhuast","DE-HS6B",4.72]
["Pole End Cap","SPS-2/CAP",3.85,"6x12","LI-10V12X6",7.42]
{"$rows_left_out":187}
{"sheet":"Furnace","index":6,"n_rows":65,"n_cols":9,"rows_kept":65,"cut":false,"hidden":false,"merged":[[8,1,13,1],[4,1,6,1],[4,9,13,10],[21,1,25,1],[15,1,19,1],[27,9,47,10],[15,9,25,10],[27,1,37,1],[39,1,47,1],[39,3,39,4],[40,3,40,4],[47,3,47,4],[41,3,41,4],[42,3,42,4],[43,3,43,4],[44,3,44,4],[45,3,45,4],[46,3,46,4],[36,3,36,4],[37,3,37,4],[30,3,30,4],[62,3,62,5],[63,3,63,5],[64,3,64,5],[54,3,54,5],[55,3,55,5],[56,3,56,5],[57,3,57,5],[58,3,58,5],[59,3,59,5],[60,3,60,5],[61,3,61,5],[1,2,1,8],[50,2,50,6],[51,3,51,5],[52,3,52,5],[53,3,53,5],[27,3,27,4],[28,3,28,4],[29,3,29,4],[31,3,31,4],[32,3,32,4],[33,3,33,4],[34,3,34,4],[35,3,35,4]]}
[]
[null,null,"Bryant Condensing 90+ Furnaces "]
[]
[null,null,"Model Number","BTU Out (High)","BTU Out (Low)","Height","Depth","Width","Price"]
[null,"Preferred - 96% - 2-Stage Variable Speed Constant Torque ECM","926TC30040V14",39000,25000,"35\"","29 1/2\"","14\"",1932]
[null,null,"926TC36040V17",39000,25000,"35\"","29 1/2\"","17\"",1966]
[null,null,"926TC36060V14",58000,38000,"35\"","29 1/2\"","14\"",1997]
[null,null,null,null,null,null,null,null," "]
[null,"Preferred - 97% - 2-Stage Variable Speed Constant Torque ECM","927TA48060V17",58000,38000,"35\"","29 1/2\"","17\"",2286]
[null,null,"927TA48080V17",78000,50000,"35\"","29 1/2\"","17\"",2315]
[null,null,"927TA60080V21",78000,50000,"35\"","29 1/2\"","21\"",2380]
[null,null,"927TA60100V21",97000,63000,"35\"","29 1/2\"","21\"",2446]
[null,null,"927TA66100V21",97000,63000,"35\"","29 1/2\"","21\"",2639]
[null,null,"927TA66120V24",117000,76000,"35\"","29 1/2\"","24\"",2642]
[]
{"$rows_left_out":51}
{"sheet":"Coil","index":7,"n_rows":63,"n_cols":8,"rows_kept":63,"cut":false,"hidden":false,"merged":[[4,1,24,1],[26,1,40,1],[42,1,55,1],[57,1,62,1],[1,2,1,7]]}
[]
[null,null,"Bryant R454B Evaporator Coils"]
[]
[null,null,"Model Number","Ton","Height","Width","Depth","Price"]
[null,"Puron Advance R454B Vertical Cased Vertical \"V\" Aluminum Coil with TXV","CVAVA1814XMA",1.5,"14-11/16","14\"","20-5/8",545]
[null,null,"CVAVA2414XMA",2,"14-11/16","14\"","20-5/8",588]
[null,null,"CVAVA2417XMA",2,"14-11/16","17\"","20-5/8",602]
[null,null,"CVAVA2517XMA",2,"19-7/16","17\"","20-5/8",938]
[null,null,"CVAVA3014XMA",2.5,"17-1/16","14\"","20-5/8",642]
[null,null,"CVAVA3017XMA",2.5,"19-7/16","17\"","20-5/8",642]
[null,null,"CVAVA3117XMA",2.5,"25-13/16","17\"","20-5/8",999]
[null,null,"CVAVA3617XMA",3,"19-7/16","17\"","20-5/8",687]
[null,null,"CVAVA3621XMA",3,"19-1/16","21\"","20-5/8",717]
[null,null,"CVAVA3721XMA",3,"21-15/16","21\"","20-5/8",870]
[null,null,"CVAVA3817XMA",3,"29-3/4","17\"","20-5/8",887]
{"$rows_left_out":49}
{"sheet":"Air Handler","index":8,"n_rows":36,"n_cols":14,"rows_kept":36,"cut":false,"hidden":false,"merged":[[30,1,35,1],[30,10,35,11],[27,1,28,1],[27,10,28,11],[4,1,7,1],[9,1,12,1],[14,1,20,1],[22,1,25,1],[9,13,10,14],[3,10,7,11],[9,10,12,11],[14,10,25,11],[1,2,1,9]]}
[]
[null,null,"Bryant Fan Coils"]
[]
[null,null,"Model Number","Capacity","Height","Width","Depth","Filter Size","Coil Type","Price"]
[null,"Evolution Variable Speed Fan Coils with TXV and Filter","FE5BNXB24L00",2,"43\"","17\"","22\"","16 x 20","A",1978]
[null,null,"FE5BNXC36L00",3,"53\"","21\"","22\"","20 x 20","Slope",2210]
[null,null,"FE5BNXC48L00",4,"53\"","21\"","22\"","20 x 20","A",2594]
[null,null,"FE5BNBD60L00",5,"59\"","24\"","22\"","24 x 20","A",2837]
[]
[null,"Preferred Series Variable Speed Fan Coils with TXV and Filter - InteliSense Technology","FT5ANXB24L00",2,43,"17\"","22\"","16 x 20","A",1884,null,null,null,"Note: These Fan Coils use the KFFEH or Tutco EC Series Electric Heaters Only"]
[null,null,"FT5ANXC36L00",3,54,"21\"","22\"","20 x 20","Slope",2112]
[null,null,"FT5ANXC48L00",4,54,"21\"","22\"","20 x 20","A",2413]
[null,null,"FT5ANBD60L00",5,59,"24\"","22\"","24 x 20","A",2812]
[]
[null,"Legacy Series Fan Coils with TXV and Filter ","FJ5ANXA18L00",1.5,"43\"","14\"","22\"","13 X 20","Slope",1120]
{"$rows_left_out":22}
{"sheet":"Geothermal","index":9,"n_rows":37,"n_cols":9,"rows_kept":37,"cut":false,"hidden":false,"merged":[[33,3,33,7],[35,1,36,1],[35,3,35,7],[36,3,36,7],[4,1,8,1],[10,1,13,1],[15,1,19,1],[21,1,24,1],[29,1,30,1],[29,3,29,7],[30,3,30,7],[27,2,27,7],[31,2,31,13],[21,3,21,7],[22,3,22,7],[23,3,23,7],[24,3,24,7],[3,9,24,10],[17,4,17,5],[17,6,17,7],[18,4,18,5],[18,6,18,7],[19,4,19,5],[19,6,19,7],[15,4,15,5],[15,6,15,7],[16,4,16,5],[16,6,16,7],[11,4,11,5],[11,6,11,7],[12,4,12,5],[12,6,12,7],[13,4,13,5],[13,6,13,7],[1,2,1,8],[10,4,10,5],[10,6,10,7]]}
[]
[null,null,"Bryant R454B Geothermal Units"]
[]
[null,null,"Model Number","Tons","Cabinet","Discharge","COAX","Hot Water Generator","Price"]
[null,"Evolution Package Unit - 2 stage - Variable Speed w/ dissapation system","GCA24VTLCDET1DX1",2,"Vertical","Top","Copper","Yes",6455]
[null,null,"GCA36VTLCDET1DX1",3,"Vertical","Top","Copper","Yes",7202]
[null,null,"GCA48VTLCDET1DX1",4,"Vertical","Top","Copper","Yes",7834]
[null,null,"GCA60VTLCDET1DX1",5,"Vertical","Top","Copper","Yes",8672]
[null,null,"GCA72VTLCDET1DX1",6,"Vertical","Top","Copper","Yes",8880]
[]
[null,"Evolution Split Unit - 2 stage w/ dissapation system","GZ024SAXCDXX1DX1",2,"Copper",null,"Yes",null,5049]
[null,null,"GZ036SAXCDXX1DX2",3,"Copper",null,"Yes",null,5688]
[null,null,"GZ048SAXCDXX1DX1",4,"Copper",null,"Yes",null,6225]
[null,null,"GZ060SAXCDXX1DX1",5,"Copper",null,"Yes",null,6677]
[]
{"$rows_left_out":23}
{"sheet":"Heater Pack","index":10,"n_rows":68,"n_cols":6,"rows_kept":68,"cut":false,"hidden":false,"merged":[[30,1,35,1],[37,1,40,1],[4,1,7,1],[17,1,19,1],[21,1,24,1],[26,1,28,1],[11,1,15,1],[51,9,51,11],[52,9,52,11],[49,9,49,11],[50,9,50,11],[1,2,1,5],[47,9,47,11],[48,9,48,11],[19,2,19,5]]}
[]
[null,null,"ELECTRIC HEATERS FOR BRYANT FAN COIL UNITS"]
[]
[null,null,"Tutco Number","Factory Number","Description - Heaters to be used on FE5, FT5, FJ5 Units Only"]
[null,"FJ5DNXA18","TU-EC-03CKN","KFFEH8401N03","3kw Heater  230v-1ph *USED ON FJ5DNXA18 Only!*",124]
[null,null,"TU-EC-05CKB","KFFEH8401C05","5kw Heater w/ C/B Protection - 230v-1ph *USED ON FJ5DNXA18 Size Only!*",214]
[null,null,"TU-EC-08CKB","KFFEH8501C08","8kw Heater w/ C/B Protection - 230v-1ph *USED ON FJ5DNXA18 Size Only!*",238]
[null,null,"TU-EC-10CKB","KFFEH8601C10","10kw Heater w/ C/B Protection - 230v-1ph *USED ON FJ5DNXA18 Size Only!*",246]
[]
[null,"FJ5DNXA24 ONLY","TU-EC-03BKN","KFFEH0401N03","3kw Heater - 230v-1ph* Used on 24 Size Only*",110]
[]
[null,"24-60 Size Units    (FE5, FT5, FJ5) ","TU-EC-05BKB","KFFEH2401C05","5kw Heater w/ C/B Protection - 230v-1ph *Used on 24-60 Size units*",173]
[null,null,"TU-EC-08BKB","KFFEH2501C08","8kw Heater w/ C/B Protection - 230v-1ph *Used on 24-60 Size units*",204]
[null,null,"TU-EC-10BKB","KFFEH2601C10","10kw Heater w/ C/B Protection - 230v-1ph *Used on 24-60 Size units*",210]
[null,null,"TU-EC-15BKB","KFFEH3101C15","15kw Heater w/ C/B Protection -230v-1ph *Used on 24-60 Size Units*",353]
{"$rows_left_out":54}
{"sheet":"Misc","index":11,"n_rows":57,"n_cols":6,"rows_kept":57,"cut":false,"hidden":false,"merged":[[31,0,44,0],[24,1,24,2],[25,1,25,2],[26,1,26,2],[27,1,27,2],[28,1,28,2],[30,1,30,5],[14,0,28,0],[19,1,19,2],[20,1,20,2],[21,1,21,2],[23,1,23,2],[18,1,18,2],[22,1,22,2],[1,1,1,5],[2,0,11,0],[2,1,2,2],[7,1,7,2],[3,1,3,2],[4,1,4,2],[5,1,5,2],[6,1,6,2],[11,1,11,2],[48,3,48,5],[13,1,13,5],[8,1,8,2],[9,1,9,2],[10,1,10,2],[14,1,14,2],[15,1,15,2],[16,1,16,2],[17,1,17,2]]}
[]
[]
["Bottom Boxes","FURNACE",null,"DESCRIPTION","ITEM NUMBER","COST"]
[null,"14\"",null,"Bottom Box for 14\" wide furnace","ST-96-142824",81.99]
[null,"17\"",null,"Bottom box for 17\" wide furnace","ST-96-172824",76.680000000000007]
[null,"21\"",null,"Bottom box for 21\" wide furnace","ST-96-212824",76.680000000000007]
[null,"24\"",null,"Bottom box for 24\" wide furnace","ST-96-242824",94.57]
[null,"AIR HANDLER"]
[null,"14\"",null,"Bottom box for 14\" wide x 22\" deep AH","ST-96-142224",80.16]
[null,"17\"",null,"Bottom box for 17\" wide x 22\" deep AH","ST-96-172224",83.75]
[null,"21\"",null,"Bottom box for 21\" wide x 22\" deep AH","ST-96-212224",69.67]
[null,"24\"",null,"Bottom box for 24\" wide x 22\" deep AH","ST-96-242224",81.489999999999995]
[]
[]
["Plenums","FURNACE",null,"DESCRIPTION","ITEM NUMBER","COST"]
{"$rows_left_out":43}
{"sheet":"Dropdown Lists","index":12,"n_rows":45,"n_cols":10,"rows_kept":45,"cut":false,"hidden":false,"merged":[]}
["Family","Size From","Size To","Part Number","Description / Notes","Phase","DROPDOWN ENGINE  —  do not edit",null,null,"3-phase packs (red)"]
["FJ5",18,18,"TU-EC-03CKN","3kw 230v-1ph — FJ5 size 18 only","1PH",null,null,null,{"$f":"_xlfn._xlws.FILTER(HeaterPacks[Part Number],HeaterPacks[Phase]=\"3PH\")","v":"TU-EC-15BHN"}]
["FJ5",18,18,"TU-EC-05CKB","5kw w/CB 230v-1ph — FJ5 size 18 only","1PH","Air Handler tons (B10)",{"$f":"IFERROR(_xlfn.XLOOKUP('Rough In'!B10,'Air Handler'!$C:$C,'Air Handler'!$D:$D),\"\")","v":0},null,"TU-EC-18BHN"]
["FJ5",18,18,"TU-EC-08CKB","8kw w/CB 230v-1ph — FJ5 size 18 only","1PH","Geo unit tons (B11)",{"$f":"IFERROR(_xlfn.XLOOKUP('Rough In'!B11,Geothermal!$C:$C,Geothermal!$D:$D),\"\")","v":0},null,"TU-EC-25BHCF"]
["FJ5",18,18,"TU-EC-10CKB","10kw w/CB 230v-1ph — FJ5 size 18 only","1PH","Air handler family",{"$f":"IF(LEFT('Rough In'!B11,3)=\"GCA\",\"GCA\",_xlfn.IFS(LEFT('Rough In'!B10,4)=\"FMA5\",\"FMA5\",LEFT('Rough In'!B10,6)=\"45MBAA\",\"45MBAA\",LEFT('Rough In'!B10,6)=\"45MUAA\",\"45MUAA\",LEFT('Rough In'!B10,3)=\"FE5\",\"FE5\",LEFT('Rough In'!B10,3)=\"FT5\",\"FT5\",LEFT('Rough In'!B10,3)=\"FJ5\",\"FJ5\",TRUE,\"\"))","v":""},null,"TU-EC-30BHCF"]
["FJ5",24,24,"TU-EC-03BKN","3kw 230v-1ph — FJ5 size 24 only","1PH","Nominal size",{"$f":"IF(H5=\"GCA\",IFERROR(H4*12,\"\"),IFERROR(H3*12,\"\"))","v":0}]
["FE5,FT5,FJ5",24,60,"TU-EC-05BKB","5kw w/CB 230v-1ph — sizes 24-60","1PH"]
["FE5,FT5,FJ5",24,60,"TU-EC-08BKB","8kw w/CB 230v-1ph — sizes 24-60","1PH","Compatible packs ▼",{"$f":"IF(OR(H5=\"\",H6=\"\"),\"\",IFERROR(_xlfn._xlws.FILTER(HeaterPacks[Part Number],ISNUMBER(SEARCH(H5,HeaterPacks[Family]))*(HeaterPacks[Size From]<=H6)*(HeaterPacks[Size To]>=H6)),\"\"))","v":""}]
["FE5,FT5,FJ5",24,60,"TU-EC-10BKB","10kw w/CB 230v-1ph — sizes 24-60","1PH"]
["FE5,FT5,FJ5",24,60,"TU-EC-15BKB","15kw w/CB 230v-1ph — sizes 24-60","1PH"]
["FE5,FT5,FJ5",30,60,"TU-EC-20BKB","20kw w/CB 230v-1ph — sizes 30-60","1PH"]
["FE5,FT5,FJ5",36,60,"TU-EC-15BHN","15kw 230v-3ph — sizes 36-60","3PH"]
["FE5,FT5,FJ5",42,60,"TU-EC-18BHN","15kw 230v-3ph — sizes 42-60","3PH"]
["FE5,FT5,FJ5",48,60,"TU-EC-25BHCF","24kw 230v-3ph (convertible to 1ph) — sizes 48-60","3PH"]
["FE5,FT5,FJ5",48,60,"TU-EC-30BHCF","30kw 230v-3ph (convertible to 1ph) — sizes 48-60","3PH"]
{"$rows_left_out":30}